BDBM237361 1-Benzyl-3-(4-methyl-7,8-dihydroxy-2H-chromen-2-one)benzimidazolium chloride (3f)
SMILES Oc1ccc2c(CN3CN(Cc4ccccc4)c4ccccc34)cc(=O)oc2c1O
InChI Key InChIKey=RFBUWZIMEASJMT-UHFFFAOYSA-N
Data  2 IC50
  Tab Delimited (TSV)   2D SDfile   Computed 3D by Vconf -m prep SDfile
Find this compound or compounds like it in BindingDB:
Activity Spreadsheet -- Enzyme Inhibition Constant Data from BindingDB
Found 1 hit for monomerid = 237361
TargetCarbonic anhydrase 1(Homo sapiens (Human))
Inonu University
LigandPNGBDBM237361(1-Benzyl-3-(4-methyl-7,8-dihydroxy-2H-chromen-2-on...)
Affinity DataIC50:  2.56E+4nMpH: 10.0Assay Description:CA activity was measured by the Maren method which is based on determination of the time required for the pH to decrease from 10.0 to 7.4 due to CO2 ...
Ligand InfoPC cidPC sid
In DepthDetails ArticlePubMed